{"text_format":"3","workbook":"xlsx","n_sheets":7,"sheets":["Project","Input","Results","Calculations","Evapotranspiration - references","Work Sheet","Horse"],"not_rendered":{"charts":3,"images":6,"comments":1},"read":"whole","date_system":"1900"}

{"sheet":"Project","index":0,"n_rows":49,"n_cols":19,"rows_kept":49,"merged":[[0,0,0,10],[2,0,2,9],[2,10,2,11],[4,0,4,9],[5,0,5,9],[48,0,48,4]]}
["Computing environment for specification of the impact of changes in levels in the vicinity of open streams.",{"$nulls":17},"                             "]
[]
["The product program is part of the grant of the Ministry of agriculture, the outputs of the QH82126 with the name:",{"$nulls":9}," CULS, FES, DLUI   2011 ©"]
[]
["Design methodology and realization of infiltration and safety measures in the framework"]
["of the reconstruction of hydrological conditions and farming in the countryside."]
{"$rows_empty":42}
["Fully operational under Microsoft Office Excel 2010."]

{"sheet":"Input","index":1,"n_rows":25,"n_cols":7,"rows_kept":25,"merged":[[2,1,2,4],[6,2,6,4],[8,2,8,4],[10,2,10,4],[12,2,12,4],[14,2,14,4],[16,2,16,4],[18,2,18,4],[22,2,22,4],[24,2,24,4],[48,6,48,8]]}
[]
[]
[null,"Table of input parameters"]
[]
[]
[]
[null,"Symbol","Description",null,null,"Units","Value"]
[]
[null,"H0","initial water level",null,null,"m"]
[]
{"$rows_left_out":16}
{"sheet":"Results","index":2,"n_rows":7,"n_cols":13,"rows_kept":7,"merged":[[1,1,1,5],[1,9,1,11],[3,2,3,4],[3,9,3,10],[4,2,4,4],[4,9,4,10],[5,2,5,4],[6,1,6,4],[6,9,6,10],[36,12,36,13]]}
[]
[null,"Additional auxiliary values",{"$nulls":7},"Results"]
[]
[null,"Symbol","Description",null,null,"Units","Value",null,null,"at time t",null,{"$f":"Input!G17","v":0},"day(s)"]
[null,"Hµ","aquiclude ",null,null,"m",{"$f":"(Input!G9+Input!G11)/2","v":0},null,null,"in distance at x",null,{"$f":"Input!G19","v":0},"meters"]
[null,"D","soil hydrology parameter",null,null,"m2/day",{"$f":"IF(ISERR(Input!G13*G5/Input!G15),0,Input!G13*G5/Input!G15)","v":0}]
[null,"argument of error function",{"$nulls":3},"(-)",{"$f":"IF(ISERR(Input!G19/(2*SQRT(G6*Input!G17))),0,Input!G19/(2*SQRT(G6*Input!G17)))","v":0},null,null,"ground water level",null,{"$f":"IF(G7=0,0,Input!G11+(Input!G9-Input!G11)*ERF(Results!G7)+(Input!G23/1000)/Input!G15-(Input!G25/1000)/Input!G15)","v":0},"meters."]

{"sheet":"Calculations","index":3,"n_rows":16,"n_cols":13,"rows_kept":16,"merged":[[1,1,1,4],[3,1,5,2],[3,3,3,12],[3,13,5,13]]}
[]
[null,"Detailed stepwise calculation"]
[]
[null,"distance (m)",null,"time (days)"]
[{"$nulls":3},"t0","t1","t2","t3","t4","t5","t6","t7","t8","t9"]
[{"$nulls":3},{"$f":"(Input!G17)/10","v":0},{"$f":"D6+D6","v":0},{"$f":"E6+D6","v":0},{"$f":"F6+D6","v":0},{"$f":"G6+D6","v":0},{"$f":"H6+D6","v":0},{"$f":"I6++D6","v":0},{"$f":"J6+D6","v":0},{"$f":"K6+D6","v":0},{"$f":"L6+D6","v":0}]
[null,"x0",{"$f":"(Input!G19)/10","v":0},{"$f":"IF(OR(Input!G17=\"\",Input!G17=0),0,Input!G11+(Input!G9-Input!G11)*ERF('Work Sheet'!D9)+(Input!G23/1000)/Input!G15-(Input!G25/1000)/Input!G15)","v":0},{"$f":"IF(OR(Input!G17=\"\",Input!G17=0),0,Input!G11+(Input!G9-Input!G11)*ERF('Work Sheet'!E9)+(Input!G23/1000)/Input!G15-(Input!G25/1000)/Input!G15)","v":0},{"$f":"IF(OR(Input!G17=\"\",Input!G17=0),0,Input!G11+(Input!G9-Input!G11)*ERF('Work Sheet'!F9)+(Input!G23/1000)/Input!G15-(Input!G25/1000)/Input!G15)","v":0},{"$f":"IF(OR(Input!G17=\"\",Input!G17=0),0,Input!G11+(Input!G9-Input!G11)*ERF('Work Sheet'!G9)+(Input!G23/1000)/Input!G15-(Input!G25/1000)/Input!G15)","v":0},{"$f":"IF(OR(Input!G17=\"\",Input!G17=0),0,Input!G11+(Input!G9-Input!G11)*ERF('Work Sheet'!H9)+(Input!G23/1000)/Input!G15-(Input!G25/1000)/Input!G15)","v":0},{"$f":"IF(OR(Input!G17=\"\",Input!G17=0),0,Input!G11+(Input!G9-Input!G11)*ERF('Work Sheet'!I9)+(Input!G23/1000)/Input!G15-(Input!G25/1000)/Input!G15)","v":0},{"$f":"IF(OR(Input!G17=\"\",Input!G17=0),0,Input!G11+(Input!G9-Input!G11)*ERF('Work Sheet'!J9)+(Input!G23/1000)/Input!G15-(Input!G25/1000)/Input!G15)","v":0},{"$f":"IF(OR(Input!G17=\"\",Input!G17=0),0,Input!G11+(Input!G9-Input!G11)*ERF('Work Sheet'!K9)+(Input!G23/1000)/Input!G15-(Input!G25/1000)/Input!G15)","v":0},{"$f":"IF(OR(Input!G17=\"\",Input!G17=0),0,Input!G11+(Input!G9-Input!G11)*ERF('Work Sheet'!L9)+(Input!G23/1000)/Input!G15-(Input!G25/1000)/Input!G15)","v":0},{"$f":"IF(OR(Input!G17=\"\",Input!G17=0),0,Input!G11+(Input!G9-Input!G11)*ERF('Work Sheet'!M9)+(Input!G23/1000)/Input!G15-(Input!G25/1000)/Input!G15)","v":0}]
[null,"x1",{"$f":"C7+C7","v":0},{"$f":"IF(OR(Input!G17=\"\",Input!G17=0),0,Input!G11+(Input!G9-Input!G11)*ERF('Work Sheet'!D10)+(Input!G23/1000)/Input!G15-(Input!G25/1000)/Input!G15)","v":0},{"$f":"IF(OR(Input!G17=\"\",Input!G17=0),0,Input!G11+(Input!G9-Input!G11)*ERF('Work Sheet'!E10)+(Input!G23/1000)/Input!G15-(Input!G25/1000)/Input!G15)","v":0},{"$f":"IF(OR(Input!G17=\"\",Input!G17=0),0,Input!G11+(Input!G9-Input!G11)*ERF('Work Sheet'!F10)+(Input!G23/1000)/Input!G15-(Input!G25/1000)/Input!G15)","v":0},{"$f":"IF(OR(Input!G17=\"\",Input!G17=0),0,Input!G11+(Input!G9-Input!G11)*ERF('Work Sheet'!G10)+(Input!G23/1000)/Input!G15-(Input!G25/1000)/Input!G15)","v":0},{"$f":"IF(OR(Input!G17=\"\",Input!G17=0),0,Input!G11+(Input!G9-Input!G11)*ERF('Work Sheet'!H10)+(Input!G23/1000)/Input!G15-(Input!G25/1000)/Input!G15)","v":0},{"$f":"IF(OR(Input!G17=\"\",Input!G17=0),0,Input!G11+(Input!G9-Input!G11)*ERF('Work Sheet'!I10)+(Input!G23/1000)/Input!G15-(Input!G25/1000)/Input!G15)","v":0},{"$f":"IF(OR(Input!G17=\"\",Input!G17=0),0,Input!G11+(Input!G9-Input!G11)*ERF('Work Sheet'!J10)+(Input!G23/1000)/Input!G15-(Input!G25/1000)/Input!G15)","v":0},{"$f":"IF(OR(Input!G17=\"\",Input!G17=0),0,Input!G11+(Input!G9-Input!G11)*ERF('Work Sheet'!K10)+(Input!G23/1000)/Input!G15-(Input!G25/1000)/Input!G15)","v":0},{"$f":"IF(OR(Input!G17=\"\",Input!G17=0),0,Input!G11+(Input!G9-Input!G11)*ERF('Work Sheet'!L10)+(Input!G23/1000)/Input!G15-(Input!G25/1000)/Input!G15)","v":0},{"$f":"IF(OR(Input!G17=\"\",Input!G17=0),0,Input!G11+(Input!G9-Input!G11)*ERF('Work Sheet'!M10)+(Input!G23/1000)/Input!G15-(Input!G25/1000)/Input!G15)","v":0}]
[null,"x2",{"$f":"C8+C7","v":0},{"$f":"IF(OR(Input!G17=\"\",Input!G17=0),0,Input!G11+(Input!G9-Input!G11)*ERF('Work Sheet'!D11)+(Input!G23/1000)/Input!G15-(Input!G25/1000)/Input!G15)","v":0},{"$f":"IF(OR(Input!G17=\"\",Input!G17=0),0,Input!G11+(Input!G9-Input!G11)*ERF('Work Sheet'!E11)+(Input!G23/1000)/Input!G15-(Input!G25/1000)/Input!G15)","v":0},{"$f":"IF(OR(Input!G17=\"\",Input!G17=0),0,Input!G11+(Input!G9-Input!G11)*ERF('Work Sheet'!F11)+(Input!G23/1000)/Input!G15-(Input!G25/1000)/Input!G15)","v":0},{"$f":"IF(OR(Input!G17=\"\",Input!G17=0),0,Input!G11+(Input!G9-Input!G11)*ERF('Work Sheet'!G11)+(Input!G23/1000)/Input!G15-(Input!G25/1000)/Input!G15)","v":0},{"$f":"IF(OR(Input!G17=\"\",Input!G17=0),0,Input!G11+(Input!G9-Input!G11)*ERF('Work Sheet'!H11)+(Input!G23/1000)/Input!G15-(Input!G25/1000)/Input!G15)","v":0},{"$f":"IF(OR(Input!G17=\"\",Input!G17=0),0,Input!G11+(Input!G9-Input!G11)*ERF('Work Sheet'!I11)+(Input!G23/1000)/Input!G15-(Input!G25/1000)/Input!G15)","v":0},{"$f":"IF(OR(Input!G17=\"\",Input!G17=0),0,Input!G11+(Input!G9-Input!G11)*ERF('Work Sheet'!J11)+(Input!G23/1000)/Input!G15-(Input!G25/1000)/Input!G15)","v":0},{"$f":"IF(OR(Input!G17=\"\",Input!G17=0),0,Input!G11+(Input!G9-Input!G11)*ERF('Work Sheet'!K11)+(Input!G23/1000)/Input!G15-(Input!G25/1000)/Input!G15)","v":0},{"$f":"IF(OR(Input!G17=\"\",Input!G17=0),0,Input!G11+(Input!G9-Input!G11)*ERF('Work Sheet'!L11)+(Input!G23/1000)/Input!G15-(Input!G25/1000)/Input!G15)","v":0},{"$f":"IF(OR(Input!G17=\"\",Input!G17=0),0,Input!G11+(Input!G9-Input!G11)*ERF('Work Sheet'!M11)+(Input!G23/1000)/Input!G15-(Input!G25/1000)/Input!G15)","v":0}]
[null,"x3",{"$f":"C9+C7","v":0},{"$f":"IF(OR(Input!G17=\"\",Input!G17=0),0,Input!G11+(Input!G9-Input!G11)*ERF('Work Sheet'!D12)+(Input!G23/1000)/Input!G15-(Input!G25/1000)/Input!G15)","v":0},{"$f":"IF(OR(Input!G17=\"\",Input!G17=0),0,Input!G11+(Input!G9-Input!G11)*ERF('Work Sheet'!E12)+(Input!G23/1000)/Input!G15-(Input!G25/1000)/Input!G15)","v":0},{"$f":"IF(OR(Input!G17=\"\",Input!G17=0),0,Input!G11+(Input!G9-Input!G11)*ERF('Work Sheet'!F12)+(Input!G23/1000)/Input!G15-(Input!G25/1000)/Input!G15)","v":0},{"$f":"IF(OR(Input!G17=\"\",Input!G17=0),0,Input!G11+(Input!G9-Input!G11)*ERF('Work Sheet'!G12)+(Input!G23/1000)/Input!G15-(Input!G25/1000)/Input!G15)","v":0},{"$f":"IF(OR(Input!G17=\"\",Input!G17=0),0,Input!G11+(Input!G9-Input!G11)*ERF('Work Sheet'!H12)+(Input!G23/1000)/Input!G15-(Input!G25/1000)/Input!G15)","v":0},{"$f":"IF(OR(Input!G17=\"\",Input!G17=0),0,Input!G11+(Input!G9-Input!G11)*ERF('Work Sheet'!I12)+(Input!G23/1000)/Input!G15-(Input!G25/1000)/Input!G15)","v":0},{"$f":"IF(OR(Input!G17=\"\",Input!G17=0),0,Input!G11+(Input!G9-Input!G11)*ERF('Work Sheet'!J12)+(Input!G23/1000)/Input!G15-(Input!G25/1000)/Input!G15)","v":0},{"$f":"IF(OR(Input!G17=\"\",Input!G17=0),0,Input!G11+(Input!G9-Input!G11)*ERF('Work Sheet'!K12)+(Input!G23/1000)/Input!G15-(Input!G25/1000)/Input!G15)","v":0},{"$f":"IF(OR(Input!G17=\"\",Input!G17=0),0,Input!G11+(Input!G9-Input!G11)*ERF('Work Sheet'!L12)+(Input!G23/1000)/Input!G15-(Input!G25/1000)/Input!G15)","v":0},{"$f":"IF(OR(Input!G17=\"\",Input!G17=0),0,Input!G11+(Input!G9-Input!G11)*ERF('Work Sheet'!M12)+(Input!G23/1000)/Input!G15-(Input!G25/1000)/Input!G15)","v":0}]
{"$rows_left_out":7}
{"sheet":"Evapotranspiration - references","index":4,"n_rows":11,"n_cols":8,"rows_kept":11,"merged":[[3,1,3,10],[4,1,4,7],[7,1,7,3],[7,7,7,12],[8,1,8,3],[8,7,8,11],[10,1,10,5],[10,7,10,9],[12,1,12,8]]}
[]
[]
[]
[null,"The value of evapotranspiration is calculated as a separate procedure"]
[null," and represents the sum for the given period."]
[]
[]
[null,"reference to the FAO OSN:",{"$nulls":5},"http://www.fao.org/docrep/X0490E/x0490e04.htm"]
[null,"reference to the Wikipedia:",{"$nulls":5},"http://en.wikipedia.org/wiki/Evapotranspiration"]
[]
{"$rows_left_out":2}
{"sheet":"Work Sheet","index":5,"n_rows":18,"n_cols":13,"rows_kept":18,"merged":[[2,1,2,4],[4,1,4,7],[6,3,6,12],[8,1,17,1]]}
[]
[]
[null,"Assistant calculations"]
[]
[null,"the arguments of the error function ERF according to the distance and time"]
[]
[{"$nulls":3},"time"]
[{"$nulls":3},"t₀","t₁","t₂","t₃","t₄","t₅","t₆","t₇","t₈","t₉"]
[null,"distance","x₀",{"$f":"IF(OR(Input!G17=\"\",Input!G17=0,Results!G7=0), 0,Calculations!C7/(2*SQRT(Results!G6*Calculations!D6)))","v":0},{"$f":"IF(OR(Input!G17=\"\",Input!G17=0,Results!G7=0), 0,Calculations!C7/(2*SQRT(Results!G6*Calculations!E6)))","v":0},{"$f":"IF(OR(Input!G17=\"\",Input!G17=0,Results!G7=0), 0,Calculations!C7/(2*SQRT(Results!G6*Calculations!F6)))","v":0},{"$f":"IF(OR(Input!G17=\"\",Input!G17=0,Results!G7=0), 0,Calculations!C7/(2*SQRT(Results!G6*Calculations!G6)))","v":0},{"$f":"IF(OR(Input!G17=\"\",Input!G17=0,Results!G7=0), 0,Calculations!C7/(2*SQRT(Results!G6*Calculations!H6)))","v":0},{"$f":"IF(OR(Input!G17=\"\",Input!G17=0,Results!G7=0), 0,Calculations!C7/(2*SQRT(Results!G6*Calculations!I6)))","v":0},{"$f":"IF(OR(Input!G17=\"\",Input!G17=0,Results!G7=0), 0,Calculations!C7/(2*SQRT(Results!G6*Calculations!J6)))","v":0},{"$f":"IF(OR(Input!G17=\"\",Input!G17=0,Results!G7=0), 0,Calculations!C7/(2*SQRT(Results!G6*Calculations!K6)))","v":0},{"$f":"IF(OR(Input!G17=\"\",Input!G17=0,Results!G7=0), 0,Calculations!C7/(2*SQRT(Results!G6*Calculations!L6)))","v":0},{"$f":"IF(OR(Input!G17=\"\",Input!G17=0,Results!G7=0), 0,Calculations!C7/(2*SQRT(Results!G6*Calculations!M6)))","v":0}]
[null,null,"x₁",{"$f":"IF(OR(Input!G17=\"\",Input!G17=0,Results!G7=0), 0,Calculations!C8/(2*SQRT(Results!G6*Calculations!D6)))","v":0},{"$f":"IF(OR(Input!G17=\"\",Input!G17=0,Results!G7=0), 0,Calculations!C8/(2*SQRT(Results!G6*Calculations!E6)))","v":0},{"$f":"IF(OR(Input!G17=\"\",Input!G17=0,Results!G7=0), 0,Calculations!C8/(2*SQRT(Results!G6*Calculations!F6)))","v":0},{"$f":"IF(OR(Input!G17=\"\",Input!G17=0,Results!G7=0), 0,Calculations!C8/(2*SQRT(Results!G6*Calculations!G6)))","v":0},{"$f":"IF(OR(Input!G17=\"\",Input!G17=0,Results!G7=0), 0,Calculations!C8/(2*SQRT(Results!G6*Calculations!H6)))","v":0},{"$f":"IF(OR(Input!G17=\"\",Input!G17=0,Results!G7=0), 0,Calculations!C8/(2*SQRT(Results!G6*Calculations!I6)))","v":0},{"$f":"IF(OR(Input!G17=\"\",Input!G17=0,Results!G7=0), 0,Calculations!C8/(2*SQRT(Results!G6*Calculations!J6)))","v":0},{"$f":"IF(OR(Input!G17=\"\",Input!G17=0,Results!G7=0), 0,Calculations!C8/(2*SQRT(Results!G6*Calculations!K6)))","v":0},{"$f":"IF(OR(Input!G17=\"\",Input!G17=0,Results!G7=0), 0,Calculations!C8/(2*SQRT(Results!G6*Calculations!L6)))","v":0},{"$f":"IF(OR(Input!G17=\"\",Input!G17=0,Results!G7=0), 0,Calculations!C8/(2*SQRT(Results!G6*Calculations!M6)))","v":0}]
{"$rows_left_out":9}
{"sheet":"Horse","index":6,"n_rows":0,"n_cols":0,"rows_kept":0,"hidden":true,"merged":[[12,5,12,7]]}